Error failed find flength file jobs

Filtro

Mis búsquedas recientes
Filtrar por:
Presupuesto
a
a
a
Habilidades
Idiomas
    Estado del trabajo
    446 error failed find flength file trabajados encontrados, precios en USD

    ...hicieron actualizaciones, pero ahora no carga la parte web. Tengo los siguientes errores: FATAL ERROR fatal error reading freepbx_settings Trace Back /var/www/html/admin/libraries/[iniciar sesión para ver URL] die_freepbx() [0]: fatal error reading freepbx_settings /var/www/html/admin/libraries/[iniciar sesión para ver URL] freepbx_conf->_...

    $100 (Avg Bid)
    $100 Oferta Promedio
    3 ofertas

    You can see the error here: [iniciar sesión para ver URL] Site uses Yii, PHP and Mysql

    $24 (Avg Bid)
    $24 Oferta Promedio
    14 ofertas

    import via plesk Job for [iniciar sesión para ver URL] failed because the control process exited with error code. See "systemctl status [iniciar sesión para ver URL]" and "journalctl -xe" for details. Unable to import the database_new dump: ERROR 1062 (23000) at line 12478: Duplicate entry 'i breeze 500 [0,127970,129113] -> [N] POST [...

    $52 (Avg Bid)
    $52 Oferta Promedio
    15 ofertas

    import via plesk Job for [iniciar sesión para ver URL] failed because the control process exited with error code. See "systemctl status [iniciar sesión para ver URL]" and "journalctl -xe" for details. Unable to import the database_new dump: ERROR 1062 (23000) at line 12478: Duplicate entry 'i breeze 500 [0,127970,129113] -> [N] POST [...

    $30 (Avg Bid)
    $30 Oferta Promedio
    4 ofertas

    [iniciar sesión para ver URL] is getting a "secure connection failed" error for some browsers: see: [iniciar sesión para ver URL]://[iniciar sesión para ver URL] I need help to fix this issue.

    $99 (Avg Bid)
    $99 Oferta Promedio
    42 ofertas

    Only need fixe for gradle 4.4 synchronization . and build apps complete show on ui . just fixed it . if you are experience on it it just less than 20 mins . thank you

    $20 / hr (Avg Bid)
    $20 / hr Oferta Promedio
    11 ofertas

    Hey! Can someone help me with this error? I am not able to start my react-native app. Android studio shows this error: "Failed to resolve: react-native" If I start the react-native app with the console, the error "Execution failed for task ':app:processDebugResources'." appears.

    $6 / hr (Avg Bid)
    $6 / hr Oferta Promedio
    21 ofertas

    Error: /project/gradlew: Command failed with exit code 1 Error output: FAILURE: Build failed with an exception. A problem occurred configuring root project 'project'. Here is the exact error: Could not find [iniciar sesión para ver URL] ([iniciar sesión para ver URL]:play-services-auth-base-license:11.8.0). Searched in the follow...

    $16 / hr (Avg Bid)
    $16 / hr Oferta Promedio
    5 ofertas

    fix failed disk in FreeNas . .. freenas error down

    $463 (Avg Bid)
    $463 Oferta Promedio
    17 ofertas

    I need someone to configure my email server. It must be very simple but I do not know how to do it. Currently I get this error "550-No Such User Here 550 Sender verify failed" When I send an email from my server to hotmail, it bounces me; when I send to another domain I also reboot it, and gmail receives it but fails to identify the sender. And from

    $26 (Avg Bid)
    $26 Oferta Promedio
    9 ofertas

    here's the error - I need you to fox this. I would but I do not have time - this is no more than 1 hour - do not bid if you think it will take more time because if you do you're unqualified to do the work. What would you like to do? ------------------------------------------------------------------------------- 1: Attempt to reinstall this existing

    $26 (Avg Bid)
    $26 Oferta Promedio
    6 ofertas

    I have attached a detail document here. It's a simple game work. I worked this with an indian team. But they were full of cheaters. He took my money and gave so bad works. I dont' want to fail again. He still not feeling about their fault at all. So I want you guys to make a bad review on their company first. Then I will be able to discuss with you project. Don't regard my price her...

    $1074 (Avg Bid)
    $1074 Oferta Promedio
    27 ofertas

    ...position, please take a test (video link) I included here so that we can know your ability. The video is 63 seconds long, and please transcribe in clean verbatim and save as a text file(No need to mark the speakers). Thank you! It will be much appreciated if you can tell us how much you charge to transcribe a one hour long audio. We are looking for individual

    $26 (Avg Bid)
    $26 Oferta Promedio
    8 ofertas

    ...an example and also the test in the file section below. Our rates are strictly 8-12$ per 1000 words. Please send your saved test results in the format eg. moffat_12$_freelancer. Meaning name_your rate in USD_platform. Kindly bid if you are serious, find the attached test do it and send. Start with the word "find my test" in your proposal so that I will

    $11 / hr (Avg Bid)
    $11 / hr Oferta Promedio
    21 ofertas

    After noting that divorce rate in America is almost 40% i decided to write a kindle book and publish it on Amazon. I am a third year psychology student so I have some advice to add to this book and I also have specific books to cite ( e.g evolutionary psychology)

    $48 (Avg Bid)
    $48 Oferta Promedio
    14 ofertas
    joomla update failed Finalizado left
    VERIFICADO

    Hi I have tried to upgrade my joomla to current version unfortunatelly it has failed. I need someone to repair and update to lates joomla version.

    $27 (Avg Bid)
    $27 Oferta Promedio
    20 ofertas

    After the installation of the SSL Certificate I'm receiving an error: SSL operation failed with code 1. OpenSSL Error messages:nerror:14090086:SSL routines:SSL3_GET_SERVER_CERTIFICATE:certificate verify failed in and I need to sort it out. I have tried different options to solve it myself but it's still not working. The website's SSL is working

    $62 (Avg Bid)
    $62 Oferta Promedio
    29 ofertas

    I'm working on a test case where I'm trying to test async action creator for a failed response. But the error is a promise and when the unit test is running the error promise is not resolving and the test is failing. eg: // [iniciar sesión para ver URL] export const fetchData = () => { return (dispatch) => { return fetchJSON(URL).t...

    $10 - $30
    $10 - $30
    0 ofertas

    fix asap issue with our email not delivered "550 Reverse DNS lookup failed for IP...."

    $22 (Avg Bid)
    $22 Oferta Promedio
    16 ofertas

    ...position, please take a test (video link) I included here so that we can know your ability. The video is 63 seconds long, and please transcribe in clean verbatim and save as a text file(No need to mark the speakers). Thank you! (We only require accuracy of 93% and above It will be much appreciated if you can tell us how much you charge to transcribe a one

    $20 / hr (Avg Bid)
    Destacado
    $20 / hr Oferta Promedio
    10 ofertas

    just comment me 55 if you understant what i want. im geting 'failed to open stream: No such file or directory' error when i use copy(); it will take 1 min for solwe ofcouse if you know. i think its php 7.2 problem its working in old versions. source file is in attach. required: file will work on my host.

    $22 (Avg Bid)
    $22 Oferta Promedio
    24 ofertas

    ...teamviewer or anydesktop . check: [iniciar sesión para ver URL] chech attached photos. trasncript error shwon: 401. That’s an error. Error: invalid_client The OAuth client was not found. Request Details client_id=[iniciar sesión para ver URL]

    $12 / hr (Avg Bid)
    $12 / hr Oferta Promedio
    23 ofertas

    I need you to develop some software for me. I would like this software to be developed using PHP.

    $23 (Avg Bid)
    $23 Oferta Promedio
    1 ofertas

    Fix server issues. We are using vultr and since few hours it’s been giving a httpd failed error. Will need someone who is familiar with management of servers to fix this asap. Thanks!

    $35 (Avg Bid)
    $35 Oferta Promedio
    17 ofertas

    I try to build an app from source there is very popular. However in the building process its fail on one command. I searched on internet to find solutions. There is some, but i can't figure out to solved it. Need and meteor framework expert. The App Dependencies: NodeJS, Meteor, Yarn, Electron, Gulp

    $21 (Avg Bid)
    $21 Oferta Promedio
    3 ofertas

    Hi, I am working with google player services in unity3d 2017.3.1f1 on mac, whenever I import the package I got few errors, I am good in unity but not in Android native, so please bid only if you are an expert in Unity+Android, please start your bid with I can fix it on teamviewer , Before bidding you should look into the files carefully and let me know who can do it.

    $26 (Avg Bid)
    $26 Oferta Promedio
    3 ofertas

    ...would like this software to be developed for Windows using SQL. Need you to go through my SQL server 2008 install log and tell me why it won't instal, I get 2 error messages the first being failed to setup data base and the second being instance does not exist. Need this problem solved asap. Extra details are I'm trying to install M.U.T software and this

    $25 (Avg Bid)
    $25 Oferta Promedio
    3 ofertas

    ...ONLY. HI we are receiving error (32)Broken pipe: mod_fcgid: ap_pass_brigade failed in handle_request_ipc function our sql server is going mental with load. we have tried all the methods on google but nothing worked. need your help now. we are running apache, linux with centos and php version 5.7 the error is only on one website. so that

    $27 (Avg Bid)
    $27 Oferta Promedio
    6 ofertas

    ...you can use to approximate the location. Deliverable: - For each address which is a simple mispelling, provide a mapping of wrong address to corrected address (in a .txt file) - For all other addresses, provide a shapefile which defines the address locations AND a streets layer which defines any missing streets. Existing streets from OSM layer must

    $175 (Avg Bid)
    $175 Oferta Promedio
    19 ofertas

    I need a php developer who can provide a very fast service on bug fixing at Ajax call. I have a fixed budget of around 25 USD, but if there is a guy who can do this in 5 minutes, will pay him bonus for sure. Write "I am a super php developer" on your proposal, else your bid will be hidden or removed.

    $24 (Avg Bid)
    $24 Oferta Promedio
    30 ofertas

    Hello there, I am running a website with high traffic, I've installed Varnish becouse of website speed, when it reaches 2,300 online, it gives me 503 (Backend fetch failed) Varnish cache error. Maybe there is Varnish installed incorrectly, or there is a script problam wich burns the server. I also had atack from China/Russia Ip's but I've blocked them

    $134 (Avg Bid)
    $134 Oferta Promedio
    13 ofertas

    Solve this issue: [iniciar sesión para ver URL]

    $37 / hr (Avg Bid)
    $37 / hr Oferta Promedio
    7 ofertas

    my server use cenos and suddenly its mysql server/services has failed and we need it back to work asap. pls bid only if you have the previous experience regarding this work.

    $66 (Avg Bid)
    $66 Oferta Promedio
    24 ofertas

    ...from 12.5 to 17.5 and now our mail client round cube is not working properly. when trying to attach a file it does not attach and corrupts the file. also when trying to send email it gives this error SMTP Error (250): Authentication failed. we need this sorted urgently right now, also you have to work via teamviewer as we can not share our

    $26 (Avg Bid)
    $26 Oferta Promedio
    4 ofertas

    When customers use Our Payment Platform and the transaction fails, an order is still genera... theres a fix for this here [iniciar sesión para ver URL] and [iniciar sesión para ver URL] and Regards

    $37 (Avg Bid)
    $37 Oferta Promedio
    21 ofertas

    To recover the data from the RAID-5 array.

    $151 (Avg Bid)
    $151 Oferta Promedio
    3 ofertas

    ...get the following error when I try to run my project. You will ned log to my computer using TeamViewer and fix remotely. I had a problem with ExpendableLabel framework and removed it from the search path but I may have caused another problem Error i get : ld: framework not found -framework clang: error: linker command failed with exit code 1

    $36 (Avg Bid)
    $36 Oferta Promedio
    9 ofertas

    Plesk update failed / Restore of Plesk, no files on server or databses to be affected by the restore of plesk.

    $128 (Avg Bid)
    $128 Oferta Promedio
    18 ofertas

    ...page, and you will see the fish in your cart. Error that is showing in inspector is: Uncaught DOMException: Failed to set the 'domain' property on 'Document': '[iniciar sesión para ver URL]' is not a suffix of '[iniciar sesión para ver URL]'. at [iniciar sesión para ver URL]:1237:49 This error only happens...

    $8 / hr (Avg Bid)
    $8 / hr Oferta Promedio
    9 ofertas

    ...page, and you will see the fish in your cart. Error that is showing in inspector is: Uncaught DOMException: Failed to set the 'domain' property on 'Document': '[iniciar sesión para ver URL]' is not a suffix of '[iniciar sesión para ver URL]'. at [iniciar sesión para ver URL]:1237:49 This error only happens...

    $8 / hr (Avg Bid)
    $8 / hr Oferta Promedio
    17 ofertas

    ...page, and you will see the fish in your cart. Error that is showing in inspector is: Uncaught DOMException: Failed to set the 'domain' property on 'Document': '[iniciar sesión para ver URL]' is not a suffix of '[iniciar sesión para ver URL]'. at [iniciar sesión para ver URL]:1237:49 This error only happens...

    $9 / hr (Avg Bid)
    $9 / hr Oferta Promedio
    10 ofertas

    ...page, and you will see the fish in your cart. Error that is showing in inspector is: Uncaught DOMException: Failed to set the 'domain' property on 'Document': '[iniciar sesión para ver URL]' is not a suffix of '[iniciar sesión para ver URL]'. at [iniciar sesión para ver URL]:1237:49 This error only happens...

    $7 / hr (Avg Bid)
    $7 / hr Oferta Promedio
    6 ofertas

    ...subcat=Doorbusters And try to add 1 fish to cart. You will see the fish doesn't add, BUT then reload page, and you will see the fish in your cart. Error that is happening is: Uncaught DOMException: Failed to set the 'domain' property on 'Document': '[iniciar sesión para ver URL]' is not a suffix of '[iniciar sesión para v...

    $9 / hr (Avg Bid)
    $9 / hr Oferta Promedio
    6 ofertas

    ...subcat=Doorbusters And try to add 1 fish to cart. You will see the fish doesn't add, BUT then reload page, and you will see the fish in your cart. Error that is happening is: Uncaught DOMException: Failed to set the 'domain' property on 'Document': '[iniciar sesión para ver URL]' is not a suffix of '[iniciar sesión para v...

    $8 / hr (Avg Bid)
    $8 / hr Oferta Promedio
    6 ofertas

    ...subcat=Doorbusters And try to add 1 fish to cart. You will see the fish doesn't add, BUT then reload page, and you will see the fish in your cart. Error that is happening is: Uncaught DOMException: Failed to set the 'domain' property on 'Document': '[iniciar sesión para ver URL]' is not a suffix of '[iniciar sesión para v...

    $9 / hr (Avg Bid)
    $9 / hr Oferta Promedio
    5 ofertas

    ...subcat=Doorbusters And try to add 1 fish to cart. You will see the fish doesn't add, BUT then reload page, and you will see the fish in your cart. Error that is happening is: Uncaught DOMException: Failed to set the 'domain' property on 'Document': '[iniciar sesión para ver URL]' is not a suffix of '[iniciar sesión para v...

    $8 / hr (Avg Bid)
    $8 / hr Oferta Promedio
    7 ofertas

    ...subcat=Doorbusters And try to add 1 fish to cart. You will see the fish doesn't add, BUT then reload page, and you will see the fish in your cart. Error that is happening is: Uncaught DOMException: Failed to set the 'domain' property on 'Document': '[iniciar sesión para ver URL]' is not a suffix of '[iniciar sesión para v...

    $8 / hr (Avg Bid)
    $8 / hr Oferta Promedio
    5 ofertas

    I'm trying to install my theme and the required plug ins. However, this keeps failing because it says "Installation failed: Could not create directory" I need a professional who knows how to resolve this problem

    $23 (Avg Bid)
    $23 Oferta Promedio
    37 ofertas

    i am having issue with my file manager on webmin HTTP/1.0 500 Perl execution failed Server: MiniServ/1.860 Date: Tue, 28 Nov 2017 17:47:32 GMT Content-type: text/html; Charset=iso-8859-1 Connection: close

    $23 (Avg Bid)
    $23 Oferta Promedio
    5 ofertas

    I have a server from ovh on which i installed Ubuntu 14.04 and i want to install Ajenti (v) on it. But, NGINX service failed error came [iniciar sesión para ver URL] . I need someone who can fix.

    $27 (Avg Bid)
    $27 Oferta Promedio
    5 ofertas